{"text_format":"1","workbook":"xlsx","n_sheets":8,"sheets":["Measures","Policy matrix @ threat","References","Categories vs. Stages","Drop down lists","Stats","Tables","Track record"],"not_rendered":{"charts":0,"images":0,"macros":1,"external_links":0,"defined_names":0,"comments":0,"pivot_tables":0},"unopened":[],"bounds":{"document_bytes":16777216,"sheet_cells":100000,"rows_first":2000,"rows_last":500,"rows_between":2000,"halvings":0,"cell_chars":16384,"cell_head_chars":4096},"cells_cut":0,"cells_raw":0,"read":"whole","date_system":"1900"}

{"sheet":"Measures","index":0,"n_rows":554,"n_cols":26,"rows_kept":554,"cut":false,"hidden":false,"merged":[]}
["Nr.","Main threat","Specific threat","Climate parameter","Adaptation measure","Asset type","Policy","Category of measure","Stage","Scale","Qualitative score on criteria",null,null,null,null,"Green","Contribution to sustainability criteria",null,null,null,null,null,null,"Extra information about the measure","Comments","Ref.no."]
[null,null,null,null,null,null,null,null,null,null,"Availability","Safety","Impact on network","Direct cost","Reputation",null,"General / Management","Climate change and Energy","People and Communities","Ecology / Biodiversity","Physical resources","Quality of Life","Safety, Health & Equity"]
[1,"01 Flooding of road surface (assuming no traffic is possible)","01-1 flooding due to failure of flood defence system of rivers and canals",{"$f":"VLOOKUP(C3,climate_par_table,2)","v":{"$error":"#NAME?"}},"Access restriction","Mobility services","Extreme event management","Traffic management","Response","Stretch",2,0,-2,2,-1,"YES",2,2,1,0,1,0,0,"Real time weather and traffic forecasts, preventive information, real time traffic info, modal shift, are parts of all traffic management adaptation measures "]
[2,"01 Flooding of road surface (assuming no traffic is possible)","01-1 Flooding due to failure of flood defence system of rivers and canals",{"$f":"VLOOKUP(C4,climate_par_table,2)","v":{"$error":"#NAME?"}},"Avoid deforestation in the catchment area","Geotechnics, including landslips and rock falls, cuts","Pro-active attitude","Resilient construction","Pro-action","Object - stretch - network",3,1,0,-1,2,"YES",0,3,3,3,0,2,2]
[3,"01 Flooding of road surface (assuming no traffic is possible)","01-1 Flooding due to failure of flood defence system of rivers and canals",{"$f":"VLOOKUP(C5,climate_par_table,2)","v":{"$error":"#NAME?"}},"Build dams, reservoirs and retaining ponds to buffer the water","Geotechnics, including landslips and rock falls, cuts","Pro-active attitude","Robust construction","Pro-action","Object - stretch - network",2,0,0,-1,2,"YES",1,0,0,2,-1,0,0]
[4,"01 Flooding of road surface (assuming no traffic is possible)","01-1 Flooding due to failure of flood defence system of rivers and canals",{"$f":"VLOOKUP(C6,climate_par_table,2)","v":{"$error":"#NAME?"}},"Build flood walls to protect the road from flooding","Geotechnics, including landslips and rock falls, cuts","Pro-active attitude","Robust construction","Pro-action","Object - stretch - network",2,1,0,-2,-1,"YES",-1,-1,2,-2,-1,-1,0,null,null,47]
[5,"01 Flooding of road surface (assuming no traffic is possible)","01-1 flooding due to failure of flood defence system of rivers and canals",{"$f":"VLOOKUP(C7,climate_par_table,2)","v":{"$error":"#NAME?"}},"Carriageway cross-over","All road infrastructure","Extreme event management","Traffic management","Response","Stretch",-2,-1,0,-2,-2,"YES",0,0,0,0,1,1,2,"Real time weather and traffic forecasts, preventive information, real time traffic info, modal shift, are parts of all traffic management adaptation measures ","If dual carriageway "]
[6,"01 Flooding of road surface (assuming no traffic is possible)","01-1 Flooding due to failure of flood defence system of rivers and canals",{"$f":"VLOOKUP(C8,climate_par_table,2)","v":{"$error":"#NAME?"}},"Carrying out risk assessment of  identified areas","Geotechnics, including landslips and rock falls, cuts","Pro-active attitude","Planning","Pro-action","Object - stretch - network",1,2,1,-2,2,"YES",-2,-1,1,0,0,0,0,null,null,47]
[7,"01 Flooding of road surface (assuming no traffic is possible)","01-1 Flooding due to failure of flood defence system of rivers and canals",{"$f":"VLOOKUP(C9,climate_par_table,2)","v":{"$error":"#NAME?"}},"Clear natural blockages such as shrubs and weeds","Drainage of earthworks and pavements, sewers","Preventive maintenance and replacement","Maintenance and replacement","Preparation","Object",1,0,-1,2,-1,"YES",0,1,0,0,1,0,0]
[8,"01 Flooding of road surface (assuming no traffic is possible)","01-1 flooding due to failure of flood defence system of rivers and canals",{"$f":"VLOOKUP(C10,climate_par_table,2)","v":{"$error":"#NAME?"}},"Construction of (temporary) flood barriers along road","All road infrastructure","Extreme event management","Robust construction","Response","Stretch",2,1,1,-2,1,"NO",0,0,0,0,0,0,1,null,null,"-"]
[9,"01 Flooding of road surface (assuming no traffic is possible)","01-1 flooding due to failure of flood defence system of rivers and canals",{"$f":"VLOOKUP(C11,climate_par_table,2)","v":{"$error":"#NAME?"}},"Develop plans and routines for the priority of securing areas prone to flooding","All road infrastructure","Pro-active attitude","Planning","Pro-action","Object - stretch - network",1,2,-1,-1,2,"YES",0,0,0,0,0,0,0,null,null,47]
[10,"01 Flooding of road surface (assuming no traffic is possible)","01-1 flooding due to failure of flood defence system of rivers and canals",{"$f":"VLOOKUP(C12,climate_par_table,2)","v":{"$error":"#NAME?"}},"Drainage of road embankment for fast lowering of groundwater table after flood retreats","Drainage of earthworks and pavements, sewers","Upgrade / retrofitting / new construction","Resilient construction","Preparation","Object - stretch",1,0,0,-1,1,"YES",-2,-1,-1,-1,0,0,0]
[11,"01 Flooding of road surface (assuming no traffic is possible)","01-1 flooding due to failure of flood defence system of rivers and canals",{"$f":"VLOOKUP(C13,climate_par_table,2)","v":{"$error":"#NAME?"}},"Dredge to increase depths and/or straighten the stream","All road infrastructure","Pro-active attitude","Robust construction","Pro-action","National network",1,-1,0,-1,-1,"YES",-2,-1,1,-2,0,0,0,null,null,56]
[12,"01 Flooding of road surface (assuming no traffic is possible)","01-1 flooding due to failure of flood defence system of rivers and canals",{"$f":"VLOOKUP(C14,climate_par_table,2)","v":{"$error":"#NAME?"}},"Elevated roads above High Water Level","All road infrastructure","Prevention","Robust construction","Prevention","Stretch - network",2,2,2,-3,1,"NO",2,0,0,0,-2,0,2,null,null,1]
[13,"01 Flooding of road surface (assuming no traffic is possible)","01-1 flooding due to failure of flood defence system of rivers and canals",{"$f":"VLOOKUP(C15,climate_par_table,2)","v":{"$error":"#NAME?"}},"Install sign posts warning for flooding in threatened areas","Mobility services","Traffic management","Traffic management","Preparation","Object - stretch - network",3,2,-1,-1,0,"NO",0,0,0,0,0,0,0]
{"$rows_left_out":540}
{"sheet":"Policy matrix @ threat","index":1,"n_rows":87,"n_cols":21,"rows_kept":87,"cut":false,"hidden":false,"merged":[]}
[null,"Threat main category :",{"$f":"B28","v":"04 Loss of road structure integrity"},null,"‘Do minimum’ and ‘Develop contingency plans’ strategy"]
[null,"Threat sub category :",{"$f":"C28","v":"04-1 Impact on soil moisture levels, affecting the structural integrity of roads, bridges and tunnels"},null,"‘Future-proof designs’, ‘Retrofit solutions’ and ‘Update operating procedures’ strategies"]
[null,"Climate parameter :",{"$f":"D28","v":"Seasonal and annual average rainfall, sea level rise, extreme wind speed, wind direction (-> storm surge)"},null,"‘Monitoring’ strategy"]
[null,null,null,null,"‘Research’ strategy"]
[]
[null,"STAGES","PRO-ACTION","PREVENTION","PREPARATION",null,"RESPONSE",null,"RECOVERY"]
[null,null,null,null,"In preparation of an extreme event","Just before an extreme event","During an extreme event","Just after an extreme event","After an extreme event"]
[null,"OBJECTIVES","Enable smooth and safe traffic",null,"Support disaster consequence reduction","Evacuation route, life supply route","Minimizing loss of functions","Supply route for repairs and humanitarian aid","Supply route for recovery of affected area"]
["CATEGORY OF ADAPTATION MEASURE","Planning for CCI&EWE",{"$f":"IF(LEN(L25)>0,\"PRO-ACTIVE ATTITUDE: \"&LEFT(L25,LEN(L25)-2),\"\")","v":{"$error":"#NAME?"}},null,null,{"$f":"IF(LEN(R25)>0,\"EXTREME EVENT MANAGEMENT: \"&LEFT(R25,LEN(R25)-2),\"\")","v":{"$error":"#NAME?"}}]
[null,"Robust construction",null,{"$f":"IF(LEN(M25)>0,\"PREVENTION: \"&LEFT(M25,LEN(M25)-2),\"\")","v":{"$error":"#NAME?"}}]
[null,"Legislation , regulations"]
[null,"Resilient construction",null,{"$f":"IF(LEN(N25)>0,\"UPGRADE, RETROFIT, NEW CONSTRUCTION: \"&LEFT(N25,LEN(N25)-2),\"\")","v":{"$error":"#NAME?"}}]
[null,"Maintenance and management",null,null,{"$f":"IF(LEN(O25)>0,\"PREVENTIVE MAINTENANCE AND REPLACEMENT: \"&LEFT(O25,LEN(O25)-2),\"\")","v":{"$error":"#NAME?"}},null,null,null,{"$f":"IF(LEN(P25)>0,\"CORRECTIVE MAINTENANCE AND REPLACEMENT: \"&LEFT(P25,LEN(P25)-2),\"\")","v":{"$error":"#NAME?"}}]
[null,"Traffic management for CCI&EWE",null,{"$f":"IF(LEN(Q25)>0,\"TRAFFIC MANAGEMENT: \"&LEFT(Q25,LEN(Q25)-2),\"\")","v":{"$error":"#NAME?"}}]
[null,"Capacity building",{"$f":"IF(LEN(S25)>0,\"CAPACITY BUILDING: \"&LEFT(S25,LEN(S25)-2),\"\")","v":{"$error":"#NAME?"}}]
{"$rows_left_out":73}
{"sheet":"References","index":2,"n_rows":0,"n_cols":0,"rows_kept":0,"cut":false,"hidden":false,"merged":[]}

{"sheet":"Categories vs. Stages","index":3,"n_rows":16,"n_cols":10,"rows_kept":16,"cut":false,"hidden":true,"merged":[]}
[]
[null,null,"STAGES","PRO-ACTION","PREVENTION","PREPARATION",null,"RESPONSE",null,"RECOVERY"]
[null,null,null,null,null,"In preparation of an extreme event","Just before an extreme event","During an extreme event","Just after an extreme event","After an extreme event"]
[null,"Activity category","OBJECTIVES","Enable smooth and safe traffic",null,"Support disaster consequence reduction","Evacuation route, life supply route","Minimizing loss of functions","Supply route for repairs and humanitarian aid","Supply route for recovery of affected area"]
["CATEGORY OF ADAPTATION MEASURE","SP Defining and managing network strategy and planning","Planning for CCI&EWE","Pro-active attitude",null,null,"Extreme event management"]
[null,"DC Design and construction of new and replacement assets","Robust construction",null,"Prevention"]
[null,null,"Legislation , regulations"]
[null,null,"Resilient construction",null,"Upgrade, retrofit, new construction"]
[null,"MM Maintenance and management of existing assets","Maintenance and management",null,null,"Preventive Maintenance and Replacement",null,null,null,"Corrective Maintenance and Replacement"]
[null,"NW managing network operation","Traffic management for CCI&EWE",null,"Traffic management"]
[null,null,"Capacity building","Capacity buIlding"]
[null,null,"Monitoring","Monitoring and prediction"]
[null,null,"Research ","Research"]
[]
[null,null,"CCI&EWE = Climate Change Impacts and Extreme Weather Events","PRO-ACTION phase: aims to rule out the possibility of an extreme event, e.g. flood defences to prevent flooding","PREVENTION phase: aims to eliminate vulnerability, e.g. raising a road above the High Water Level","PREPARATION phase 1: aims to reduce consequences, e.g. erosion proofing of a road","PREPARATION phase 2: aims to support evacuation, e.g. provide shelter locations","RESPONSE phase 1: aims to minimize damage, e.g. shutting down systems","RESPONSE phase 2: aims to guide emergency transport, e.g. restricting heavy traffic on saturated roads","RECOVERY phase: aims to restore transport functionality, e.g. deployment of repairs"]
{"$rows_left_out":2}
{"sheet":"Drop down lists","index":4,"n_rows":39,"n_cols":10,"rows_kept":39,"cut":false,"hidden":true,"merged":[]}
[]
["RIMAROCC Guideline Flipped Table 1 v2","RIMAROCC Guideline Table 1","ROADAPT WP description","ROADAPT meeting Sep 2013",null,"ROADAPT meeting Sep 2013","ROADAPT meeting Sep 2013","RIMAROCC Guideline","ROADAPT meeting September 2013","ROADAPT meeting April 2013"]
["Threat main category","Threat sub category","Asset type","Policy",null,"Categorie of measure","Stage","Scale","Qualitative score on criteria / Contribution to sustainability criteria","Green"]
["01 Flooding of road surface (assuming no traffic is possible)","01-1 flooding due to failure of flood defence system of rivers and canals","Geotechnics, including landslips and rock falls, cuts","Pro-active attitude",1,"Capacity building","Pro-action","Object - stretch - network","-3","YES"]
["02 Erosion of road embankments and foundations","01-2 pluvial flooding (overland flow after precipitation, increase of groundwater levels, increase of aquifer hydraulic heads)","Drainage of earthworks and pavements, sewers","Prevention",2,"Legislation , regulations","Prevention","TEN-T EU network","-2","NO"]
["03 Landslips and avalanches","01-3 Inundation of roads in coastal areas, combining the effects of sea level rise and storm surges","Pavements: bituminous, concrete, semi-rigid","Upgrade / retrofitting / new construction",3,"Maintenance and replacement","Preparation","TEN-T - national - regional",-1]
["04 Loss of road structure integrity","01-4 Flooding from snow melt (overland flow after snow melt)","Pavements: bituminous, semi-rigid","Preventive maintenance and replacement",4,"Monitoring","Response","National network","0"]
["05 Loss of pavement integrity","02-1 Overloading of hydraulic systems crossing the road","Bituminous pavements","Corrective maintenance and replacement",5,"Planning","Recovery","Regional network",1]
["06 Loss of driving ability due to extreme weather events","02-2 Erosion of road bases","Concrete pavements","Traffic management",6,"Research ","All","Stretch - network","2"]
["07 Reduced ability for maintenance","02-3 Bridge scour","Semi-rigid pavements","Extreme event management",7,"Resilient construction",null,"Stretch","3"]
["08 Susceptibility to wildfires that threaten the transportation infrastructure directly","03-1 External slides affecting the road","Brick pavement","Capacity building",8,"Robust construction",null,"Object - stretch"]
["09 Damage to signs, lighting fixtures and supports","03-2 Slides of the road embankment","Unpaved roads","Monitoring and prediction",9,"Traffic management",null,"Object"]
["10 Trees falling on the road","03-3 Debris flow","Mobility services","Research"]
[null,"03-4 Rock fall","All road infrastructure"]
[null,"03-5 Snow avalanches","Tunnels, low lying stretches and light weight embankments"]
{"$rows_left_out":25}
{"sheet":"Stats","index":5,"n_rows":40,"n_cols":18,"rows_kept":40,"cut":false,"hidden":true,"merged":[]}
["yellow = NOT considered in measures database"]
[]
["RIMAROCC Guideline Flipped Table 1 v2",null,"RIMAROCC Guideline Table 1",null,"ROADAPT WP description",null,"ROADAPT meeting Sep 2013",null,"ROADAPT meeting Sep 2013",null,"ROADAPT meeting Sep 2013",null,"RIMAROCC Guideline",null,"ROADAPT meeting September 2013",null,"ROADAPT meeting April 2013"]
["Threat main category","no","Threat sub category","no","Asset type","no","Policy","no","Categorie of measure","no","Stage","no","Scale","no","Qualitative score on criteria / Contribution to sustainability criteria","no","Green","no"]
["01 Flooding of road surface (assuming no traffic is possible)",{"$f":"COUNTIF(Measures!$B$4:$B$554,Stats!A5)","v":146},"01-1 flooding due to failure of flood defence system of rivers and canals",{"$f":"COUNTIF(Measures!$C$4:$C$554,Stats!C5)","v":36},"Geotechnics, including landslips and rock falls, cuttings",{"$f":"COUNTIF(Measures!$F$4:$F$554,Stats!E5)","v":5},"Pro-active attitude",{"$f":"COUNTIF(Measures!$G$4:$G$554,Stats!G5)","v":122},"Planning",{"$f":"COUNTIF(Measures!$H$4:$H$554,Stats!I5)","v":71},"Pro-action",{"$f":"COUNTIF(Measures!$I$4:$I$554,Stats!K5)","v":173},"Object - stretch - network",{"$f":"COUNTIF(Measures!$J$4:$J$554,Stats!M5)","v":114},"-3",{"$f":"COUNTIF(Measures!$Q$4:$W$554,Stats!O5)","v":57},"YES",{"$f":"COUNTIF(Measures!$P$4:$P$554,Stats!Q5)","v":332}]
["02 Erosion of road embankments and foundations",{"$f":"COUNTIF(Measures!$B$4:$B$554,Stats!A6)","v":97},"01-2 pluvial flooding (overland flow after precipitation, increase of groundwater levels, increase of aquifer hydraulic heads)",{"$f":"COUNTIF(Measures!$C$4:$C$554,Stats!C6)","v":46},"Drainage of earthworks and pavements, sewers",{"$f":"COUNTIF(Measures!$F$4:$F$554,Stats!E6)","v":53},"Prevention",{"$f":"COUNTIF(Measures!$G$4:$G$554,Stats!G6)","v":88},"Robust construction",{"$f":"COUNTIF(Measures!$H$4:$H$554,Stats!I6)","v":108},"Prevention",{"$f":"COUNTIF(Measures!$I$4:$I$554,Stats!K6)","v":88},"TEN-T EU network",{"$f":"COUNTIF(Measures!$J$4:$J$554,Stats!M6)","v":0},"-2",{"$f":"COUNTIF(Measures!$Q$4:$W$554,Stats!O6)","v":212},"NO",{"$f":"COUNTIF(Measures!$P$4:$P$554,Stats!Q6)","v":219}]
["03 Landslips and avalanches",{"$f":"COUNTIF(Measures!$B$4:$B$554,Stats!A7)","v":97},"01-3 Inundation of roads in coastal areas, combining the effects of sea level rise and storm surges",{"$f":"COUNTIF(Measures!$C$4:$C$554,Stats!C7)","v":34},"Pavements: bituminous, concrete, semi-rigid",{"$f":"COUNTIF(Measures!$F$4:$F$554,Stats!E7)","v":108},"Upgrade / retrofitting / new construction",{"$f":"COUNTIF(Measures!$G$4:$G$554,Stats!G7)","v":62},"Legislation , regulations",{"$f":"COUNTIF(Measures!$H$4:$H$554,Stats!I7)","v":27},"Preparation",{"$f":"COUNTIF(Measures!$I$4:$I$554,Stats!K7)","v":134},"TEN-T - national - regional",{"$f":"COUNTIF(Measures!$J$4:$J$554,Stats!M7)","v":32},-1,{"$f":"COUNTIF(Measures!$Q$4:$W$554,Stats!O7)","v":394}]
["04 Loss of road structure integrity",{"$f":"COUNTIF(Measures!$B$4:$B$554,Stats!A8)","v":74},"01-4 Flooding from snow melt (overland flow after snow melt)",{"$f":"COUNTIF(Measures!$C$4:$C$554,Stats!C8)","v":30},"Pavements: bituminous, semi-rigid",{"$f":"COUNTIF(Measures!$F$4:$F$554,Stats!E8)","v":16},"Preventive maintenance and replacement",{"$f":"COUNTIF(Measures!$G$4:$G$554,Stats!G8)","v":37},"Resilient construction",{"$f":"COUNTIF(Measures!$H$4:$H$554,Stats!I8)","v":70},"Response",{"$f":"COUNTIF(Measures!$I$4:$I$554,Stats!K8)","v":134},"National network",{"$f":"COUNTIF(Measures!$J$4:$J$554,Stats!M8)","v":35},"0",{"$f":"COUNTIF(Measures!$Q$4:$W$554,Stats!O8)","v":2214}]
["05 Loss of pavement integrity",{"$f":"COUNTIF(Measures!$B$4:$B$554,Stats!A9)","v":65},"02-1 Overloading of hydraulic systems crossing the road",{"$f":"COUNTIF(Measures!$C$4:$C$554,Stats!C9)","v":44},"Bituminous pavements",{"$f":"COUNTIF(Measures!$F$4:$F$554,Stats!E9)","v":5},"Corrective maintenance and replacement",{"$f":"COUNTIF(Measures!$G$4:$G$554,Stats!G9)","v":21},"Maintenance and replacement",{"$f":"COUNTIF(Measures!$H$4:$H$554,Stats!I9)","v":67},"Recovery",{"$f":"COUNTIF(Measures!$I$4:$I$554,Stats!K9)","v":14},"Regional network",{"$f":"COUNTIF(Measures!$J$4:$J$554,Stats!M9)","v":119},1,{"$f":"COUNTIF(Measures!$Q$4:$W$554,Stats!O9)","v":450}]
["06 Loss of driving ability due to extreme weather events",{"$f":"COUNTIF(Measures!$B$4:$B$554,Stats!A10)","v":62},"02-2 Erosion of road bases",{"$f":"COUNTIF(Measures!$C$4:$C$554,Stats!C10)","v":21},"Concrete pavements",{"$f":"COUNTIF(Measures!$F$4:$F$554,Stats!E10)","v":14},"Traffic management",{"$f":"COUNTIF(Measures!$G$4:$G$554,Stats!G10)","v":99},"Traffic management",{"$f":"COUNTIF(Measures!$H$4:$H$554,Stats!I10)","v":118},"All",{"$f":"COUNTIF(Measures!$I$4:$I$554,Stats!K10)","v":8},"Stretch - network",{"$f":"COUNTIF(Measures!$J$4:$J$554,Stats!M10)","v":39},"2",{"$f":"COUNTIF(Measures!$Q$4:$W$554,Stats!O10)","v":496}]
["07 Reduced ability for maintenance",{"$f":"COUNTIF(Measures!$B$4:$B$554,Stats!A11)","v":10},"02-3 Bridge scour",{"$f":"COUNTIF(Measures!$C$4:$C$554,Stats!C11)","v":32},"Semi-rigid pavements",{"$f":"COUNTIF(Measures!$F$4:$F$554,Stats!E11)","v":2},"Extreme event management",{"$f":"COUNTIF(Measures!$G$4:$G$554,Stats!G11)","v":33},"Capacity building",{"$f":"COUNTIF(Measures!$H$4:$H$554,Stats!I11)","v":17},null,null,"Stretch",{"$f":"COUNTIF(Measures!$J$4:$J$554,Stats!M11)","v":81},"3",{"$f":"COUNTIF(Measures!$Q$4:$W$554,Stats!O11)","v":34}]
["08 Susceptibility to wildfires that threaten the transportation infrastructure directly",{"$f":"COUNTIF(Measures!$B$4:$B$554,Stats!A12)","v":0},"03-1 External slides affecting the road",{"$f":"COUNTIF(Measures!$C$4:$C$554,Stats!C12)","v":23},"Brick pavement",{"$f":"COUNTIF(Measures!$F$4:$F$554,Stats!E12)","v":0},"Capacity building",{"$f":"COUNTIF(Measures!$G$4:$G$554,Stats!G12)","v":17},"Monitoring",{"$f":"COUNTIF(Measures!$H$4:$H$554,Stats!I12)","v":27},null,null,"Object - stretch",{"$f":"COUNTIF(Measures!$J$4:$J$554,Stats!M12)","v":76}]
["09 Damage to signs, lighting fixtures and supports",{"$f":"COUNTIF(Measures!$B$4:$B$554,Stats!A13)","v":0},"03-2 Slides of the road embankment",{"$f":"COUNTIF(Measures!$C$4:$C$554,Stats!C13)","v":21},"Unpaved roads",{"$f":"COUNTIF(Measures!$F$4:$F$554,Stats!E13)","v":9},"Monitoring and prediction",{"$f":"COUNTIF(Measures!$G$4:$G$554,Stats!G13)","v":26},"Research ",{"$f":"COUNTIF(Measures!$H$4:$H$554,Stats!I13)","v":17},null,null,"Object",{"$f":"COUNTIF(Measures!$J$4:$J$554,Stats!M13)","v":55}]
["10 Trees falling on the road",{"$f":"COUNTIF(Measures!$B$4:$B$554,Stats!A14)","v":0},"03-3 Debris flow",{"$f":"COUNTIF(Measures!$C$4:$C$554,Stats!C14)","v":22},"Traffic management",{"$f":"COUNTIF(Measures!$F$4:$F$554,Stats!E14)","v":0},"Research",{"$f":"COUNTIF(Measures!$G$4:$G$554,Stats!G14)","v":46}]
[null,null,"03-4 Rock fall",{"$f":"COUNTIF(Measures!$C$4:$C$554,Stats!C15)","v":18},"All road infrastructure",{"$f":"COUNTIF(Measures!$F$4:$F$554,Stats!E15)","v":138}]
{"$rows_left_out":26}
{"sheet":"Tables","index":6,"n_rows":37,"n_cols":5,"rows_kept":37,"cut":false,"hidden":true,"merged":[]}
["Threat sub category","Climate parameter"]
["01-1 flooding due to failure of flood defence system of rivers and canals","Snowmelt , rainfall in the catchment area, extreme wind speed, wind direction",null,"AV",7]
["01-2 pluvial flooding (overland flow after precipitation, increase of groundwater levels, increase of aquifer hydraulic heads)","Extreme rainfall events (heavy showers, long periods of rain)",null,"MC",8]
["01-3 Inundation of roads in coastal areas, combining the effects of sea level rise and storm surges","Sea level rise, extreme wind speed, wind direction (-> storm surge)",null,"MK",6]
["01-4 Flooding from snow melt (overland flow after snow melt)","Temperature",null,"WP6 LB",6]
["02-1 Overloading of hydraulic systems crossing the road","Extreme rainfall events (heavy showers, long periods of rain)"]
["02-2 Erosion of road bases","Sea level rise, extreme wind speed, wind direction (-> storm surge), extreme rainfall events (heavy showers, long periods of rain) "]
["02-3 Bridge scour","Sea level rise, extreme wind speed, wind direction (-> storm surge), extreme rainfall events (heavy showers, long periods of rain) "]
["03-1 External slides affecting the road","Extreme rainfall events (heavy showers, long periods of rain), after drought (consecutive dry days)"]
["03-2 Slides of the road embankment","Extreme rainfall events (heavy showers, long periods of rain), after drought (consecutive dry days)"]
["03-3 Debris flow","Extreme rainfall events (long periods of rain) "]
["03-4 Rock fall","Extreme rainfall events (heavy showers, long periods of rain), frost-thaw cycles (number of days with temperature zero-crossings)"]
["03-5 Snow avalanches","Frost-thaw cycles (number of days with temperature zero-crossings), snowfall"]
["04-1 Impact on soil moisture levels, affecting the structural integrity of roads, bridges and tunnels","Seasonal and annual average rainfall, sea level rise, extreme wind speed, wind direction (-> storm surge)"]
["04-2 Weakening of the road base by standing water","Seasonal and annual average rainfall"]
{"$rows_left_out":23}
{"sheet":"Track record","index":7,"n_rows":41,"n_cols":5,"rows_kept":41,"cut":false,"hidden":true,"merged":[]}
["version","WP","changes","modified by","date"]
["1.0","6-7-8","first proposal","AV",{"$f":"NA()","v":{"$error":"#N/A"}}]
["1.1","6-7-8","inserted column for Phase","AV",{"$f":"NA()","v":{"$error":"#N/A"}}]
["2.0","6-7-8","format according to flipped table 1","AV","2013-07-29"]
["2.1","6-7-8","Inserted column for Owner; integrated measures from WP6 by LB","AV","2013-07-30"]
["2.2","6-7-8","some changes to measures of LB","AV","2013-08-12"]
[null,null,"EGIS traffic management measures","MC","2013-09-02"]
[null,null,"comments by YE","YE","2013-09-02"]
["2.3","6-7-8","Some cleaning up","AV","2013-09-06"]
["2.4","6-7-8","Inserted draft columns for Criteria and Sustainability","AV","2013-09-07"]
["3.0","6-7-8","Terminology of Categories vs. Stages table","MC","2013-09-12"]
["3.1","6-7-8","Cleaning up, including comments in Remark column; inserted columns for Criteria and Sustainability","AV","2013-09-19"]
["4.0","6-7-8","Modification according to minutes of Paris meeting","AV","2013-12-17"]
["4.1","6-7-8","Sustainability theme 'General / management' added","AV","2014-01-09"]
["4.2","6-7-8","Sorted and split table","AV","2014-01-13"]
{"$rows_left_out":26}